Target
Insulin receptor
Ligand
BDBM50240782
Substrate
Meas. Tech.
ChEMBL_1668750 (CHEMBL4018638)
IC50
888±n/a nM
Citation
 Zhu, WChen, HWang, YWang, JPeng, XChen, XGao, YLi, CHe, YAi, JGeng, MZheng, MLiu, H Design, Synthesis, and Pharmacological Evaluation of Novel Multisubstituted Pyridin-3-amine Derivatives as Multitargeted Protein Kinase Inhibitors for the Treatment of Non-Small Cell Lung Cancer. J Med Chem 60:6018-6035 (2017)  
Target
Name:
Insulin receptor
Synonyms:
INSR INSR_HUMAN Insulin receptor beta subunit
Type:
Receptor Tyrosine Kinase
Mol. Mass.:
156322.60
Organism:
Homo sapiens (Human)
Description:
P06213
Residue:
1382
  
Inhibitor
Name:
BDBM50240782
Synonyms:
CHEMBL4075917
Type:
Small organic molecule
Emp. Form.:
C27H23FN4O2
Mol. Mass.:
454.4955
SMILES:
Cc1n[nH]c2ccc(cc12)-c1cc(N[C@@H](CO)c2ccccc2)cnc1-c1ccc(F)cc1O
: