Target
Mast/stem cell growth factor receptor Kit
Ligand
BDBM50240782
Substrate
Meas. Tech.
ChEMBL_1668760 (CHEMBL4018648)
IC50
>10.0±n/a nM
Citation
 Zhu, WChen, HWang, YWang, JPeng, XChen, XGao, YLi, CHe, YAi, JGeng, MZheng, MLiu, H Design, Synthesis, and Pharmacological Evaluation of Novel Multisubstituted Pyridin-3-amine Derivatives as Multitargeted Protein Kinase Inhibitors for the Treatment of Non-Small Cell Lung Cancer. J Med Chem 60:6018-6035 (2017)  
Target
Name:
Mast/stem cell growth factor receptor Kit
Synonyms:
CD117 antigen KIT Mast/stem cell growth factor receptor Kit (cKIT) Proto-oncogene tyrosine-protein kinase Kit Stem cell growth factor receptor Tyrosine-protein kinase Kit c-kit v-kit Hardy-Zuckerman 4 feline sarcoma viral oncogene homolog
Type:
Protein
Mol. Mass.:
109869.37
Organism:
Homo sapiens (Human)
Description:
P10721
Residue:
976
  
Inhibitor
Name:
BDBM50240782
Synonyms:
CHEMBL4075917
Type:
Small organic molecule
Emp. Form.:
C27H23FN4O2
Mol. Mass.:
454.4955
SMILES:
Cc1n[nH]c2ccc(cc12)-c1cc(N[C@@H](CO)c2ccccc2)cnc1-c1ccc(F)cc1O
: