Target
Adenosine receptor A3
Ligand
BDBM50240842
Substrate
Meas. Tech.
ChEMBL_1669078 (CHEMBL4018966)
Ki
2.7±n/a nM
Citation
 Xia, LBurger, WACvan Veldhoven, JPDKuiper, BJvan Duijl, TTLenselink, EBPaasman, EHeitman, LHIJzerman, AP Structure-Affinity Relationships and Structure-Kinetics Relationships of Pyrido[2,1-f]purine-2,4-dione Derivatives as Human Adenosine A J Med Chem 60:7555-7568 (2017)  
Target
Name:
Adenosine receptor A3
Synonyms:
A3 adenosine receptor (hA3) ADORA3 | Adenosine A3 receptor (A3AR)
Type:
G Protein-Coupled Receptor (GPCR)
Mol. Mass.:
36197.32
Organism:
Homo sapiens (Human)
Description:
P0DMS8
Residue:
318
  
Inhibitor
Name:
BDBM50240842
Synonyms:
CHEMBL4093013
Type:
Small organic molecule
Emp. Form.:
C22H22N4O3
Mol. Mass.:
390.4351
SMILES:
COc1ccn2c(c1)nc1n(Cc3ccccc3)c(=O)n(CC3CCC3)c(=O)c21
: