Target
Heat shock protein HSP 90-alpha
Ligand
BDBM50180302
Substrate
Meas. Tech.
ChEMBL_1669208 (CHEMBL4019096)
IC50
89±n/a nM
Citation
 Park, HKJeong, HKo, ELee, GLee, JELee, SKLee, AJIm, JYHu, SKim, SHLee, JHLee, CKang, SKang, BH Paralog Specificity Determines Subcellular Distribution, Action Mechanism, and Anticancer Activity of TRAP1 Inhibitors. J Med Chem 60:7569-7578 (2017)  
Target
Name:
Heat shock protein HSP 90-alpha
Synonyms:
HS90A_HUMAN HSP86 HSP90AA1 HSPCA Heat shock 86 kDa Heat shock protein HSP 90-alpha (HSP90) LAP-2 Lipopolysaccharide-associated protein 2 heat shock protein 90kDa alpha (cytosolic), class A member 1 isoform 2
Type:
Molecular Chaperone
Mol. Mass.:
84623.45
Organism:
Homo sapiens (Human)
Description:
P07900
Residue:
732
  
Inhibitor
Name:
BDBM50180302
Synonyms:
8-(6-iodo-benzo[1,3]dioxol-5-ylsulfanyl)-9-(3-isopropylamino-propyl)adenine 8-[(6-IODO-1,3-BENZODIOXOL-5-YL)THIO]-9-[3-(ISOPROPYLAMINO)PROPYL]-9H-PURIN-6-AMINE US10336757, Compound PU-H71 | US10676476, Example 9
Type:
Small organic molecule
Emp. Form.:
C18H21IN6O2S
Mol. Mass.:
512.368
SMILES:
CC(C)NCCCn1c(Sc2cc3OCOc3cc2I)nc2c(N)ncnc12
: