Target
D(2) dopamine receptor
Ligand
BDBM50001787
Substrate
Meas. Tech.
ChEBML_58717
IC50
38±n/a nM
Citation
 Perregaard, JAndersen, KHyttel, JSánchez, C Selective, centrally acting serotonin 5-HT2 antagonists. 1. 2- and 6-substituted 1-phenyl-3-(4-piperidinyl)-1H-indoles. J Med Chem 35:4813-22 (1993)  
Target
Name:
D(2) dopamine receptor
Synonyms:
DOPAMINE D2 DOPAMINE D2 Short Dopamine D2 receptor Drd2
Type:
G Protein-Coupled Receptor (GPCR)
Mol. Mass.:
50931.60
Organism:
Rattus norvegicus (rat)
Description:
P61169
Residue:
444
  
Inhibitor
Name:
BDBM50001787
Synonyms:
3-(2-{4-[1-(4-Fluoro-phenyl)-6-methyl-1H-indol-3-yl]-piperidin-1-yl}-ethyl)-1,1-dimethyl-urea | CHEMBL342104
Type:
Small organic molecule
Emp. Form.:
C25H31FN4O
Mol. Mass.:
422.5382
SMILES:
CN(C)C(=O)NCCN1CCC(CC1)c1cn(-c2ccc(F)cc2)c2cc(C)ccc12
: