Target
Angiotensin-converting enzyme
Ligand
BDBM50367254
Substrate
Meas. Tech.
ChEMBL_1671403 (CHEMBL4021432)
IC50
12±n/a nM
Citation
 Sattigeri, JASethi, SDavis, JAAhmed, SRayasam, GVJadhav, BGChilla, SMDatta, DGadhave, ATulasi, VKJain, TVoleti, SBenjamin, BUdupa, SJain, GSingh, YSrinivas, KBansal, VSRay, ABhatnagar, PKCliffe, IA Approaches towards the development of chimeric DPP4/ACE inhibitors for treating metabolic syndrome. Bioorg Med Chem Lett 27:2313-2318 (2017)  
Target
Name:
Angiotensin-converting enzyme
Synonyms:
ACE_MOUSE Dcp1
Type:
PROTEIN
Mol. Mass.:
150916.88
Organism:
Mus musculus
Description:
ChEMBL_34763
Residue:
1312
  
Inhibitor
Name:
BDBM50367254
Synonyms:
ENALAPRILAT
Type:
Small organic molecule
Emp. Form.:
C18H24N2O5
Mol. Mass.:
348.3936
SMILES:
C[C@H](N[C@@H](CCc1ccccc1)C(O)=O)C(=O)N1CCC[C@H]1C(O)=O
: