Target
Androgen receptor
Ligand
BDBM50238125
Substrate
Meas. Tech.
ChEMBL_1671471 (CHEMBL4021500)
EC50
0.190000±n/a nM
Citation
 Aikawa, KAsano, MOno, KHabuka, NYano, JWilson, KFujita, HKandori, HHara, TMorimoto, MSantou, TYamaoka, MNakayama, MHasuoka, A Synthesis and biological evaluation of novel selective androgen receptor modulators (SARMs) Part III: Discovery of 4-(5-oxopyrrolidine-1-yl)benzonitrile derivative 2f as a clinical candidate. Bioorg Med Chem 25:3330-3349 (2017)  
Target
Name:
Androgen receptor
Synonyms:
ANDR_HUMAN Androgen Receptor Androgen receptor/Baculoviral IAP repeat-containing protein 2 Dihydrotestosterone receptor Nuclear receptor subfamily 3 group C member 4
Type:
Receptor
Mol. Mass.:
99185.27
Organism:
Homo sapiens (Human)
Description:
CHO cells were stably transfected with human AR gene.
Residue:
920
  
Inhibitor
Name:
BDBM50238125
Synonyms:
CHEMBL4090028
Type:
Small organic molecule
Emp. Form.:
C13H15ClN2O
Mol. Mass.:
250.724
SMILES:
C[C@H]1[C@@H](O)CCN1c1ccc(C#N)c(Cl)c1C
: