Target
Interleukin-1 receptor-associated kinase 4
Ligand
BDBM50242729
Substrate
Meas. Tech.
ChEMBL_1672106 (CHEMBL4022135)
IC50
300±n/a nM
Citation
 Smith, GFAltman, MDAndresen, BBaker, JBrubaker, JDChen, HChen, YChilders, MDonofrio, AFerguson, HFischer, CFischmann, TOGibeau, CHicks, AJin, SKattar, SKleinschek, MALeccese, ELesburg, CLi, CLim, JLiu, DMaclean, JKFMansoor, FMoy, LYMulrooney, EFNecheva, ASPresland, JRakhilina, LYang, RTorres, LZhang-Hoover, JNorthrup, A Identification of quinazoline based inhibitors of IRAK4 for the treatment of inflammation. Bioorg Med Chem Lett 27:2721-2726 (2017)  
Target
Name:
Interleukin-1 receptor-associated kinase 4
Synonyms:
IRAK-4 IRAK4_HUMAN Interleukin-1 receptor-associated kinase 4 (IRAK4) | Renal carcinoma antigen NY-REN-64
Type:
Protein
Mol. Mass.:
51519.08
Organism:
Homo sapiens (Human)
Description:
Q9NWZ3
Residue:
460
  
Inhibitor
Name:
BDBM50242729
Synonyms:
CHEMBL4090409 | US9932350, 2-4
Type:
Small organic molecule
Emp. Form.:
C16H20F2N4
Mol. Mass.:
306.3536
SMILES:
CN(C)[C@H]1CC[C@@H](CC1)Nc1ncnc2cc(F)c(F)cc12
: