Target
Carbonic anhydrase 7
Ligand
BDBM50380140
Substrate
Meas. Tech.
ChEMBL_1673909 (CHEMBL4023938)
Kd
3.6±n/a nM
Citation
 Linkuvien?, VTalibov, VODanielson, UHMatulis, D Introduction of Intrinsic Kinetics of Protein-Ligand Interactions and Their Implications for Drug Design. J Med Chem 61:2292-2302 (2018)  
Target
Name:
Carbonic anhydrase 7
Synonyms:
CA-VII CAH7_HUMAN Carbonic anhydrase Carbonic anhydrase VII (CA VII)
Type:
Enzyme
Mol. Mass.:
29664.11
Organism:
Homo sapiens (Human)
Description:
Human cloned isozyme.
Residue:
264
  
Inhibitor
Name:
BDBM50380140
Synonyms:
CHEMBL2011155 | carbonic anhydrase (CA) inhibitors, benzenesulphonamide ligand, 10
Type:
Small organic molecule
Emp. Form.:
C12H10ClN3O3S2
Mol. Mass.:
343.809
SMILES:
NS(=O)(=O)c1cc(ccc1Cl)C(=O)CSc1ncccn1
: