Target
Carbonic anhydrase 1
Ligand
BDBM50380140
Substrate
Meas. Tech.
ChEMBL_1673906 (CHEMBL4023935)
Kd
110±n/a nM
Citation
 Linkuvien?, VTalibov, VODanielson, UHMatulis, D Introduction of Intrinsic Kinetics of Protein-Ligand Interactions and Their Implications for Drug Design. J Med Chem 61:2292-2302 (2018)  
Target
Name:
Carbonic anhydrase 1
Synonyms:
4.2.1.1 CA1 Carbonate dehydratase I Carbonic anhydrase I
Type:
PROTEIN
Mol. Mass.:
28898.91
Organism:
Equus caballus
Description:
ChEMBL_117560
Residue:
260
  
Inhibitor
Name:
BDBM50380140
Synonyms:
CHEMBL2011155 | carbonic anhydrase (CA) inhibitors, benzenesulphonamide ligand, 10
Type:
Small organic molecule
Emp. Form.:
C12H10ClN3O3S2
Mol. Mass.:
343.809
SMILES:
NS(=O)(=O)c1cc(ccc1Cl)C(=O)CSc1ncccn1
: