Target
Aurora kinase B/Inner centromere protein
Ligand
BDBM50244953
Substrate
Meas. Tech.
ChEMBL_1674175 (CHEMBL4024204)
IC50
19±n/a nM
Citation
 Li, YLuo, XGuo, QNie, YWang, TZhang, CHuang, ZWang, XLiu, YChen, YZheng, JYang, SFan, YXiang, R Discovery of N1-(4-((7-Cyclopentyl-6-(dimethylcarbamoyl)-7 H-pyrrolo[2,3- d]pyrimidin-2-yl)amino)phenyl)- N8-hydroxyoctanediamide as a Novel Inhibitor Targeting Cyclin-dependent Kinase 4/9 (CDK4/9) and Histone Deacetlyase1 (HDAC1) against Malignant Cancer. J Med Chem 61:3166-3192 (2018)  
Target
Name:
Aurora kinase B/Inner centromere protein
Synonyms:
Aurora B/Incenp
Type:
Protein Complex
Mol. Mass.:
Description:
Components:
This complex has 2 components.
Component 1
Name:
Aurora kinase B
Synonyms:
AIK2 AIM1 ARK2 AURKB_HUMAN Aurora B-INCENP Aurora kinase B (AURKB) STK-1 STK12 Serine/threonine-protein kinase aurora B
Type:
Protein
Mol. Mass.:
39327.72
Organism:
Homo sapiens (Human)
Description:
Q96GD4
Residue:
344
  
Component 2
Name:
Inner centromere protein
Synonyms:
INCENP | INCE_HUMAN
Type:
Protein
Mol. Mass.:
105461.33
Organism:
Homo sapiens (Human)
Description:
Q9NQS7
Residue:
918
  
Inhibitor
Name:
BDBM50244953
Synonyms:
CHEMBL4063500
Type:
Small organic molecule
Emp. Form.:
C28H37N7O4
Mol. Mass.:
535.6379
SMILES:
CN(C)C(=O)c1cc2cnc(Nc3ccc(NC(=O)CCCCCCC(=O)NO)cc3)nc2n1C1CCCC1
: