Target
Carbonic anhydrase 12
Ligand
BDBM50245752
Substrate
Meas. Tech.
ChEMBL_1675881 (CHEMBL4026024)
Ki
0.570000±n/a nM
Citation
 Bozdag, MAlafeefy, AMAltamimi, AMCarta, FSupuran, CTVullo, D Synthesis of new 3-(2-mercapto-4-oxo-4H-quinazolin-3-yl)-benzenesulfonamides with strong inhibition properties against the tumor associated carbonic anhydrases IX and XII. Bioorg Med Chem 25:2782-2788 (2017)  
Target
Name:
Carbonic anhydrase 12
Synonyms:
CA-XII CAH12_HUMAN Carbonic anhydrase Carbonic anhydrase XII Carbonic anhydrase XII (CAXII) | Tumor antigen HOM-RCC-3.1.3
Type:
Enzyme
Mol. Mass.:
39456.00
Organism:
Homo sapiens (Human)
Description:
Catalytic domain of human cloned isozyme was used in the assay
Residue:
354
  
Inhibitor
Name:
BDBM50245752
Synonyms:
CHEMBL4098958
Type:
Small organic molecule
Emp. Form.:
C14H10IN3O3S2
Mol. Mass.:
459.282
SMILES:
NS(=O)(=O)c1cccc(c1)-n1c(S)nc2ccc(I)cc2c1=O
: