Target
Cathepsin D
Ligand
BDBM136570
Substrate
Meas. Tech.
ChEMBL_1676274 (CHEMBL4026417)
IC50
12000±n/a nM
Citation
 Schwaid, AGCornella-Taracido, I Causes and Significance of Increased Compound Potency in Cellular or Physiological Contexts. J Med Chem 61:1767-1773 (2018)  
Target
Name:
Cathepsin D
Synonyms:
CATD_HUMAN CTSD Cathepsin D heavy chain Cathepsin D precursor
Type:
Enzyme
Mol. Mass.:
44551.72
Organism:
Homo sapiens (Human)
Description:
Human proCathepsin D (SwissProt accession number P07339) was expressed in Sf9 cells, purified, and autoactivated.
Residue:
412
  
Inhibitor
Name:
BDBM136570
Synonyms:
US8865706, 9
Type:
Small organic molecule
Emp. Form.:
C18H19F2N3O2S
Mol. Mass.:
379.424
SMILES:
C[C@H]1SC(N)=N[C@]2(CO[C@H](C[C@@H]12)c1cc(C)no1)c1ccc(F)cc1F
: