Target
Acyl-CoA (8-3)-desaturase
Ligand
BDBM50246046
Substrate
Meas. Tech.
ChEMBL_1676417 (CHEMBL4026560)
IC50
150±n/a nM
Citation
 Fujimoto, JOkamoto, RNoguchi, NHara, RMasada, SKawamoto, TNagase, HTamura, YOImanishi, MTakagahara, SKubo, KTohyama, KIida, KAndou, TMiyahisa, IMatsui, JHayashi, RMaekawa, TMatsunaga, N Discovery of 3,5-Diphenyl-4-methyl-1,3-oxazolidin-2-ones as Novel, Potent, and Orally Available?-5 Desaturase (D5D) Inhibitors. J Med Chem 60:8963-8981 (2017)  
Target
Name:
Acyl-CoA (8-3)-desaturase
Synonyms:
FADS1 FADSD5 | Fatty acid desaturase 1
Type:
PROTEIN
Mol. Mass.:
51985.80
Organism:
Homo sapiens (Human)
Description:
ChEMBL_1513296
Residue:
444
  
Inhibitor
Name:
BDBM50246046
Synonyms:
CHEMBL4069465
Type:
Small organic molecule
Emp. Form.:
C16H12Cl2FNO2
Mol. Mass.:
340.176
SMILES:
Fc1ccc(cc1)C1CN(Cc2ccc(Cl)cc2Cl)C(=O)O1
: