Target
Acyl-CoA (8-3)-desaturase
Ligand
BDBM50246057
Substrate
Meas. Tech.
ChEMBL_1676416 (CHEMBL4026559)
IC50
5800±n/a nM
Citation
 Fujimoto, JOkamoto, RNoguchi, NHara, RMasada, SKawamoto, TNagase, HTamura, YOImanishi, MTakagahara, SKubo, KTohyama, KIida, KAndou, TMiyahisa, IMatsui, JHayashi, RMaekawa, TMatsunaga, N Discovery of 3,5-Diphenyl-4-methyl-1,3-oxazolidin-2-ones as Novel, Potent, and Orally Available?-5 Desaturase (D5D) Inhibitors. J Med Chem 60:8963-8981 (2017)  
Target
Name:
Acyl-CoA (8-3)-desaturase
Synonyms:
FADS1_RAT Fatty acid desaturase 1
Type:
PROTEIN
Mol. Mass.:
52505.96
Organism:
Rattus norvegicus
Description:
ChEMBL_852948
Residue:
447
  
Inhibitor
Name:
BDBM50246057
Synonyms:
CHEMBL4069792
Type:
Small organic molecule
Emp. Form.:
C17H13FN2O2
Mol. Mass.:
296.2957
SMILES:
C[C@@H]1[C@H](OC(=O)N1c1cccc(c1)C#N)c1ccc(F)cc1
: