Target
Nicotinamide N-methyltransferase
Ligand
BDBM50247634
Substrate
Meas. Tech.
ChEMBL_1678256 (CHEMBL4028399)
Kd
2700±n/a nM
Citation
 Babault, NAllali-Hassani, ALi, FFan, JYue, AJu, KLiu, FVedadi, MLiu, JJin, J Discovery of Bisubstrate Inhibitors of Nicotinamide N-Methyltransferase (NNMT). J Med Chem 61:1541-1551 (2018)  
Target
Name:
Nicotinamide N-methyltransferase
Synonyms:
NNMT Nicotinamide N-methyltransferase | Nicotinamide N-methyltransferase (NNMT)
Type:
Protein
Mol. Mass.:
29571.16
Organism:
Homo sapiens (Human)
Description:
Residue:
264
  
Inhibitor
Name:
BDBM50247634
Synonyms:
CHEMBL4067973
Type:
Small organic molecule
Emp. Form.:
C24H32N8O6
Mol. Mass.:
528.5609
SMILES:
N[C@@H](CCCN(CCc1cccc(c1)C(N)=O)C[C@H]1O[C@H]([C@H](O)[C@@H]1O)n1cnc2c(N)ncnc12)C(O)=O
: