Target
ATP-binding cassette sub-family C member 3
Ligand
BDBM8885
Substrate
Meas. Tech.
ChEMBL_1678646 (CHEMBL4028923)
IC50
>133000±n/a nM
Citation
 Morgan, REvan Staden, CJChen, YKalyanaraman, NKalanzi, JDunn, RTAfshari, CAHamadeh, HK A multifactorial approach to hepatobiliary transporter assessment enables improved therapeutic compound development. Toxicol Sci 136:216-41 (2013)  
Target
Name:
ATP-binding cassette sub-family C member 3
Synonyms:
ABCC3 CMOAT2 MLP2 MRP3 Multi-specific organic anion transporter D | Multidrug resistance-associated protein 3
Type:
PROTEIN
Mol. Mass.:
169352.45
Organism:
Homo sapiens (Human)
Description:
ChEMBL_735421
Residue:
1527
  
Inhibitor
Name:
BDBM8885
Synonyms:
(1S,2R,10R,11S,14S,15S)-14-hydroxy-2,15-dimethyltetracyclo[8.7.0.0^{2,7}.0^{11,15}]heptadec-6-en-5-one Testosterone US9682960, Testosterone
Type:
Steroid
Emp. Form.:
C19H28O2
Mol. Mass.:
288.4244
SMILES:
[H][C@@]12CC[C@H](O)[C@@]1(C)CC[C@@]1([H])[C@@]2([H])CCC2=CC(=O)CC[C@]12C
: