Target
ATP-binding cassette sub-family C member 2
Ligand
BDBM50237612
Substrate
Meas. Tech.
ChEMBL_1678645 (CHEMBL4028922)
IC50
>133000±n/a nM
Citation
 Morgan, REvan Staden, CJChen, YKalyanaraman, NKalanzi, JDunn, RTAfshari, CAHamadeh, HK A multifactorial approach to hepatobiliary transporter assessment enables improved therapeutic compound development. Toxicol Sci 136:216-41 (2013)  
Target
Name:
ATP-binding cassette sub-family C member 2
Synonyms:
ABCC2 CMOAT CMRP Canalicular multispecific organic anion transporter 1 MRP2 Multidrug resistance-associated protein 2 Multidrug resistance-associated protein 3 (MRP3)
Type:
Protein
Mol. Mass.:
174229.45
Organism:
Homo sapiens (Human)
Description:
Q92887
Residue:
1545
  
Inhibitor
Name:
BDBM50237612
Synonyms:
CHEBI:4495 Eudemine Hyperstat Proglycem SRG-95213
Type:
Small organic molecule
Emp. Form.:
C8H7ClN2O2S
Mol. Mass.:
230.671
SMILES:
CC1=NS(=O)(=O)c2cc(Cl)ccc2N1
: