Target
Bile salt export pump
Ligand
BDBM50247985
Substrate
Meas. Tech.
ChEMBL_1678644 (CHEMBL4028921)
IC50
>133000±n/a nM
Citation
 Morgan, REvan Staden, CJChen, YKalyanaraman, NKalanzi, JDunn, RTAfshari, CAHamadeh, HK A multifactorial approach to hepatobiliary transporter assessment enables improved therapeutic compound development. Toxicol Sci 136:216-41 (2013)  
Target
Name:
Bile salt export pump
Synonyms:
ABCB11 ATP-binding cassette sub-family B member 11 Bile Salt Export Pump, BSEP Bile salt export pump (BSEP)
Type:
Protein
Mol. Mass.:
146405.49
Organism:
Homo sapiens (Human)
Description:
O95342
Residue:
1321
  
Inhibitor
Name:
BDBM50247985
Synonyms:
506U Atriance MAY Nelzarabine
Type:
Small organic molecule
Emp. Form.:
C11H15N5O5
Mol. Mass.:
297.2673
SMILES:
[H][C@]1(O[C@H](CO)[C@@H](O)[C@@H]1O)n1cnc2c(OC)nc(N)nc12
: