Target
Bile salt export pump
Ligand
BDBM50003677
Substrate
Meas. Tech.
ChEMBL_1678644 (CHEMBL4028921)
IC50
>133000±n/a nM
Citation
 Morgan, REvan Staden, CJChen, YKalyanaraman, NKalanzi, JDunn, RTAfshari, CAHamadeh, HK A multifactorial approach to hepatobiliary transporter assessment enables improved therapeutic compound development. Toxicol Sci 136:216-41 (2013)  
Target
Name:
Bile salt export pump
Synonyms:
ABCB11 ATP-binding cassette sub-family B member 11 Bile Salt Export Pump, BSEP Bile salt export pump (BSEP)
Type:
Protein
Mol. Mass.:
146405.49
Organism:
Homo sapiens (Human)
Description:
O95342
Residue:
1321
  
Inhibitor
Name:
BDBM50003677
Synonyms:
4-(p-bis(beta-chloroethyl)aminophenyl)butyric acid 4-{4-[bis(2-chloroethyl)amino]phenyl}butanoic acid CHEMBL515 Leukeran chloraminophen phenylbutyric acid nitrogen mustard
Type:
Small organic molecule
Emp. Form.:
C14H19Cl2NO2
Mol. Mass.:
304.212
SMILES:
OC(=O)CCCc1ccc(cc1)N(CCCl)CCCl
: