Target
Bile salt export pump
Ligand
BDBM50186231
Substrate
Meas. Tech.
ChEMBL_1678644 (CHEMBL4028921)
IC50
>133000±n/a nM
Citation
 Morgan, REvan Staden, CJChen, YKalyanaraman, NKalanzi, JDunn, RTAfshari, CAHamadeh, HK A multifactorial approach to hepatobiliary transporter assessment enables improved therapeutic compound development. Toxicol Sci 136:216-41 (2013)  
Target
Name:
Bile salt export pump
Synonyms:
ABCB11 ATP-binding cassette sub-family B member 11 Bile Salt Export Pump, BSEP Bile salt export pump (BSEP)
Type:
Protein
Mol. Mass.:
146405.49
Organism:
Homo sapiens (Human)
Description:
O95342
Residue:
1321
  
Inhibitor
Name:
BDBM50186231
Synonyms:
(2,3-Dichloro-4-(2-methylene-1-oxobutyl)phenoxy)acetic acid ETHACRYNIC ACID Etacrinic acid Hydromedin [2,3-dichloro-4-(2-methylidenebutanoyl)phenoxy]acetic acid | jm5b01461, Compound 72
Type:
Small organic molecule
Emp. Form.:
C13H12Cl2O4
Mol. Mass.:
303.138
SMILES:
CCC(=C)C(=O)c1ccc(OCC(O)=O)c(Cl)c1Cl
: