Target
Bile salt export pump
Ligand
BDBM50240849
Substrate
Meas. Tech.
ChEMBL_1678644 (CHEMBL4028921)
IC50
>133000±n/a nM
Citation
 Morgan, REvan Staden, CJChen, YKalyanaraman, NKalanzi, JDunn, RTAfshari, CAHamadeh, HK A multifactorial approach to hepatobiliary transporter assessment enables improved therapeutic compound development. Toxicol Sci 136:216-41 (2013)  
Target
Name:
Bile salt export pump
Synonyms:
ABCB11 ATP-binding cassette sub-family B member 11 Bile Salt Export Pump, BSEP Bile salt export pump (BSEP)
Type:
Protein
Mol. Mass.:
146405.49
Organism:
Homo sapiens (Human)
Description:
O95342
Residue:
1321
  
Inhibitor
Name:
BDBM50240849
Synonyms:
1-(2-methylpropyl)-1H-imidazo[4,5-c]quinolin-4-amine 4-Amino-1-isobutyl-1H-imidazo(4,5-c)quinoline IMIQUIMOD | R 837
Type:
Small organic molecule
Emp. Form.:
C14H16N4
Mol. Mass.:
240.3036
SMILES:
CC(C)Cn1cnc2c(N)nc3ccccc3c12
: