Target
ATP-binding cassette sub-family C member 4
Ligand
BDBM50247924
Substrate
Meas. Tech.
ChEMBL_1678647 (CHEMBL4028924)
IC50
>133000±n/a nM
Citation
 Morgan, REvan Staden, CJChen, YKalyanaraman, NKalanzi, JDunn, RTAfshari, CAHamadeh, HK A multifactorial approach to hepatobiliary transporter assessment enables improved therapeutic compound development. Toxicol Sci 136:216-41 (2013)  
Target
Name:
ATP-binding cassette sub-family C member 4
Synonyms:
ABCC4 MOAT-B MRP/cMOAT-related ABC transporter MRP4_HUMAN Multidrug resistance-associated protein 4
Type:
PROTEIN
Mol. Mass.:
149546.12
Organism:
Homo sapiens (Human)
Description:
ChEMBL_1486828
Residue:
1325
  
Inhibitor
Name:
BDBM50247924
Synonyms:
CHEBI:59273 Dexbrompheniramine fumarate | Disomer
Type:
Small organic molecule
Emp. Form.:
C20H23BrN2O4
Mol. Mass.:
435.312
SMILES:
OC(=O)\C=C/C(O)=O.CN(C)CC[C@@H](c1ccc(Br)cc1)c1ccccn1
: