Target
ATP-binding cassette sub-family C member 3
Ligand
BDBM50373919
Substrate
Meas. Tech.
ChEMBL_1678646 (CHEMBL4028923)
IC50
>133000±n/a nM
Citation
 Morgan, REvan Staden, CJChen, YKalyanaraman, NKalanzi, JDunn, RTAfshari, CAHamadeh, HK A multifactorial approach to hepatobiliary transporter assessment enables improved therapeutic compound development. Toxicol Sci 136:216-41 (2013)  
Target
Name:
ATP-binding cassette sub-family C member 3
Synonyms:
ABCC3 CMOAT2 MLP2 MRP3 Multi-specific organic anion transporter D | Multidrug resistance-associated protein 3
Type:
PROTEIN
Mol. Mass.:
169352.45
Organism:
Homo sapiens (Human)
Description:
ChEMBL_735421
Residue:
1527
  
Inhibitor
Name:
BDBM50373919
Synonyms:
AZATHIOPRINE | Azasan
Type:
Small organic molecule
Emp. Form.:
C9H7N7O2S
Mol. Mass.:
277.263
SMILES:
Cn1cnc(c1Sc1ncnc2nc[nH]c12)[N+]([O-])=O
: