Target
ATP-binding cassette sub-family C member 4
Ligand
BDBM50240849
Substrate
Meas. Tech.
ChEMBL_1678647 (CHEMBL4028924)
IC50
>133000±n/a nM
Citation
 Morgan, REvan Staden, CJChen, YKalyanaraman, NKalanzi, JDunn, RTAfshari, CAHamadeh, HK A multifactorial approach to hepatobiliary transporter assessment enables improved therapeutic compound development. Toxicol Sci 136:216-41 (2013)  
Target
Name:
ATP-binding cassette sub-family C member 4
Synonyms:
ABCC4 MOAT-B MRP/cMOAT-related ABC transporter MRP4_HUMAN Multidrug resistance-associated protein 4
Type:
PROTEIN
Mol. Mass.:
149546.12
Organism:
Homo sapiens (Human)
Description:
ChEMBL_1486828
Residue:
1325
  
Inhibitor
Name:
BDBM50240849
Synonyms:
1-(2-methylpropyl)-1H-imidazo[4,5-c]quinolin-4-amine 4-Amino-1-isobutyl-1H-imidazo(4,5-c)quinoline IMIQUIMOD | R 837
Type:
Small organic molecule
Emp. Form.:
C14H16N4
Mol. Mass.:
240.3036
SMILES:
CC(C)Cn1cnc2c(N)nc3ccccc3c12
: