Target
ATP-binding cassette sub-family C member 4
Ligand
BDBM50247985
Substrate
Meas. Tech.
ChEMBL_1678647 (CHEMBL4028924)
IC50
>133000±n/a nM
Citation
 Morgan, REvan Staden, CJChen, YKalyanaraman, NKalanzi, JDunn, RTAfshari, CAHamadeh, HK A multifactorial approach to hepatobiliary transporter assessment enables improved therapeutic compound development. Toxicol Sci 136:216-41 (2013)  
Target
Name:
ATP-binding cassette sub-family C member 4
Synonyms:
ABCC4 MOAT-B MRP/cMOAT-related ABC transporter MRP4_HUMAN Multidrug resistance-associated protein 4
Type:
PROTEIN
Mol. Mass.:
149546.12
Organism:
Homo sapiens (Human)
Description:
ChEMBL_1486828
Residue:
1325
  
Inhibitor
Name:
BDBM50247985
Synonyms:
506U Atriance MAY Nelzarabine
Type:
Small organic molecule
Emp. Form.:
C11H15N5O5
Mol. Mass.:
297.2673
SMILES:
[H][C@]1(O[C@H](CO)[C@@H](O)[C@@H]1O)n1cnc2c(OC)nc(N)nc12
: