Target
ATP-binding cassette sub-family C member 2
Ligand
BDBM22870
Substrate
Meas. Tech.
ChEMBL_1678645 (CHEMBL4028922)
IC50
>133000±n/a nM
Citation
 Morgan, REvan Staden, CJChen, YKalyanaraman, NKalanzi, JDunn, RTAfshari, CAHamadeh, HK A multifactorial approach to hepatobiliary transporter assessment enables improved therapeutic compound development. Toxicol Sci 136:216-41 (2013)  
Target
Name:
ATP-binding cassette sub-family C member 2
Synonyms:
ABCC2 CMOAT CMRP Canalicular multispecific organic anion transporter 1 MRP2 Multidrug resistance-associated protein 2 Multidrug resistance-associated protein 3 (MRP3)
Type:
Protein
Mol. Mass.:
174229.45
Organism:
Homo sapiens (Human)
Description:
Q92887
Residue:
1545
  
Inhibitor
Name:
BDBM22870
Synonyms:
13-chloro-10-(piperazin-1-yl)-2-oxa-9-azatricyclo[9.4.0.0^{3,8}]pentadeca-1(11),3,5,7,9,12,14-heptaene Amoxapine CHEMBL1113 | Demolox
Type:
Small organic molecule
Emp. Form.:
C17H16ClN3O
Mol. Mass.:
313.781
SMILES:
Clc1ccc2Oc3ccccc3N=C(N3CCNCC3)c2c1
: