Target
ATP-binding cassette sub-family C member 3
Ligand
BDBM50151860
Substrate
Meas. Tech.
ChEMBL_1678646 (CHEMBL4028923)
IC50
>133000±n/a nM
Citation
 Morgan, REvan Staden, CJChen, YKalyanaraman, NKalanzi, JDunn, RTAfshari, CAHamadeh, HK A multifactorial approach to hepatobiliary transporter assessment enables improved therapeutic compound development. Toxicol Sci 136:216-41 (2013)  
Target
Name:
ATP-binding cassette sub-family C member 3
Synonyms:
ABCC3 CMOAT2 MLP2 MRP3 Multi-specific organic anion transporter D | Multidrug resistance-associated protein 3
Type:
PROTEIN
Mol. Mass.:
169352.45
Organism:
Homo sapiens (Human)
Description:
ChEMBL_735421
Residue:
1527
  
Inhibitor
Name:
BDBM50151860
Synonyms:
4-Acetylamino-N-(2-diethylamino-ethyl)-benzamide CHEMBL1097 N-acetylprocainamide
Type:
Small organic molecule
Emp. Form.:
C15H23N3O2
Mol. Mass.:
277.362
SMILES:
CCN(CC)CCNC(=O)c1ccc(NC(C)=O)cc1
: