Target
Bile salt export pump
Ligand
BDBM50436176
Substrate
Meas. Tech.
ChEMBL_1678644 (CHEMBL4028921)
IC50
28000±n/a nM
Citation
 Morgan, REvan Staden, CJChen, YKalyanaraman, NKalanzi, JDunn, RTAfshari, CAHamadeh, HK A multifactorial approach to hepatobiliary transporter assessment enables improved therapeutic compound development. Toxicol Sci 136:216-41 (2013)  
Target
Name:
Bile salt export pump
Synonyms:
ABCB11 ATP-binding cassette sub-family B member 11 Bile Salt Export Pump, BSEP Bile salt export pump (BSEP)
Type:
Protein
Mol. Mass.:
146405.49
Organism:
Homo sapiens (Human)
Description:
O95342
Residue:
1321
  
Inhibitor
Name:
BDBM50436176
Synonyms:
Dynacirc ISRADIPINE PN-200-110
Type:
Small organic molecule
Emp. Form.:
C19H21N3O5
Mol. Mass.:
371.3871
SMILES:
COC(=O)C1=C(C)NC(C)=C(C1c1cccc2nonc12)C(=O)OC(C)C
: