Target
ATP-binding cassette sub-family C member 4
Ligand
BDBM50371228
Substrate
Meas. Tech.
ChEMBL_1678647 (CHEMBL4028924)
IC50
26800±n/a nM
Citation
 Morgan, REvan Staden, CJChen, YKalyanaraman, NKalanzi, JDunn, RTAfshari, CAHamadeh, HK A multifactorial approach to hepatobiliary transporter assessment enables improved therapeutic compound development. Toxicol Sci 136:216-41 (2013)  
Target
Name:
ATP-binding cassette sub-family C member 4
Synonyms:
ABCC4 MOAT-B MRP/cMOAT-related ABC transporter MRP4_HUMAN Multidrug resistance-associated protein 4
Type:
PROTEIN
Mol. Mass.:
149546.12
Organism:
Homo sapiens (Human)
Description:
ChEMBL_1486828
Residue:
1325
  
Inhibitor
Name:
BDBM50371228
Synonyms:
Crestor Rosuvastatin | US9006282, Rosuvastatin
Type:
Small organic molecule
Emp. Form.:
C22H27FN3O6S
Mol. Mass.:
480.53
SMILES:
CC(C)c1nc(nc(-c2ccc(F)cc2)c1\C=C\[C@@H](O)C[C@@H](O)CC([O-])=O)N(C)S(C)(=O)=O
: