Target
ATP-binding cassette sub-family C member 4
Ligand
BDBM71542
Substrate
Meas. Tech.
ChEMBL_1678647 (CHEMBL4028924)
IC50
>133000±n/a nM
Citation
 Morgan, REvan Staden, CJChen, YKalyanaraman, NKalanzi, JDunn, RTAfshari, CAHamadeh, HK A multifactorial approach to hepatobiliary transporter assessment enables improved therapeutic compound development. Toxicol Sci 136:216-41 (2013)  
Target
Name:
ATP-binding cassette sub-family C member 4
Synonyms:
ABCC4 MOAT-B MRP/cMOAT-related ABC transporter MRP4_HUMAN Multidrug resistance-associated protein 4
Type:
PROTEIN
Mol. Mass.:
149546.12
Organism:
Homo sapiens (Human)
Description:
ChEMBL_1486828
Residue:
1325
  
Inhibitor
Name:
BDBM71542
Synonyms:
(4-amino-1-methyl-butyl)-(6-methoxy-8-quinolyl)amine;phosphoric acid MLS001334045 N4-(6-methoxyquinolin-8-yl)pentane-1,4-diamine;phosphoric acid SMR000875314 | cid_359247
Type:
Small organic molecule
Emp. Form.:
C15H21N3O
Mol. Mass.:
259.3467
SMILES:
COc1cc(NC(C)CCCN)c2ncccc2c1
: