Target
Cytochrome P450 11B2, mitochondrial
Ligand
BDBM50249076
Substrate
Meas. Tech.
ChEMBL_1679695 (CHEMBL4029972)
IC50
0.200000±n/a nM
Citation
 Hoyt, SBTaylor, JLondon, CAli, AUjjainwalla, FTata, JStruthers, MCully, DWisniewski, TRen, NBopp, CSok, AVerras, AMcMasters, DChen, QTung, ETang, WSalituro, GClemas, JZhou, GMacNeil, DDuffy, RXiong, Y Discovery of indazole aldosterone synthase (CYP11B2) inhibitors as potential treatments for hypertension. Bioorg Med Chem Lett 27:2384-2388 (2017)  
Target
Name:
Cytochrome P450 11B2, mitochondrial
Synonyms:
Aldosterone Synthase (CYP11B2) Aldosterone-synthesizing enzyme CYP11B2 Cytochrome P450 11B2 Cytochrome P450 11B2, mitochondrial P-450C18 | Steroid 18-hydroxylase
Type:
Protein
Mol. Mass.:
57582.15
Organism:
Homo sapiens (Human)
Description:
P19099
Residue:
503
  
Inhibitor
Name:
BDBM50249076
Synonyms:
CHEMBL4096914
Type:
Small organic molecule
Emp. Form.:
C15H13ClFN3O
Mol. Mass.:
305.735
SMILES:
CC(C)(O)c1cncc(c1)-n1ncc2c(Cl)ccc(F)c12
: