Target
Cytochrome P450 11B2, mitochondrial
Ligand
BDBM50249045
Substrate
Meas. Tech.
ChEMBL_1679698 (CHEMBL4029975)
IC50
14±n/a nM
Citation
 Hoyt, SBTaylor, JLondon, CAli, AUjjainwalla, FTata, JStruthers, MCully, DWisniewski, TRen, NBopp, CSok, AVerras, AMcMasters, DChen, QTung, ETang, WSalituro, GClemas, JZhou, GMacNeil, DDuffy, RXiong, Y Discovery of indazole aldosterone synthase (CYP11B2) inhibitors as potential treatments for hypertension. Bioorg Med Chem Lett 27:2384-2388 (2017)  
Target
Name:
Cytochrome P450 11B2, mitochondrial
Synonyms:
Aldosterone synthase CYPXIB2 Cyp11b2 Cytochrome P450 11B2 P450-Aldo-1 | Steroid 11-beta-hydroxylase
Type:
PROTEIN
Mol. Mass.:
58260.64
Organism:
Rattus norvegicus
Description:
ChEMBL_224979
Residue:
510
  
Inhibitor
Name:
BDBM50249045
Synonyms:
CHEMBL4098297
Type:
Small organic molecule
Emp. Form.:
C16H14F3N3O
Mol. Mass.:
321.2971
SMILES:
Cc1nn(-c2cncc(c2)[C@](C)(O)C(F)(F)F)c2ccccc12
: