Target
Sortilin
Ligand
BDBM50249475
Substrate
Meas. Tech.
ChEBML_1680033
IC50
63096±n/a nM
Citation
 Andersen, JLLindberg, SLanggård, MMaltas, PJRønn, LCBBundgaard, CStrandbygaard, DThirup, SWatson, SP The identification of novel acid isostere based inhibitors of the VPS10P family sorting receptor Sortilin. Bioorg Med Chem Lett 27:2629-2633 (2017)  
Target
Name:
Sortilin
Synonyms:
Neurotensin receptor 3 SORT_HUMAN
Type:
PROTEIN
Mol. Mass.:
92054.53
Organism:
Homo sapiens (Human)
Description:
ChEMBL_1282402
Residue:
831
  
Inhibitor
Name:
BDBM50249475
Synonyms:
CHEMBL4083880
Type:
Small organic molecule
Emp. Form.:
C13H17N5O2
Mol. Mass.:
275.3064
SMILES:
CC(C)CCN1N=NC(=O)C1C(=O)Nc1ccncc1
: