Target
Sortilin
Ligand
BDBM50249498
Substrate
Meas. Tech.
ChEBML_1680033
IC50
125893±n/a nM
Citation
 Andersen, JLLindberg, SLanggård, MMaltas, PJRønn, LCBBundgaard, CStrandbygaard, DThirup, SWatson, SP The identification of novel acid isostere based inhibitors of the VPS10P family sorting receptor Sortilin. Bioorg Med Chem Lett 27:2629-2633 (2017)  
Target
Name:
Sortilin
Synonyms:
Neurotensin receptor 3 SORT_HUMAN
Type:
PROTEIN
Mol. Mass.:
92054.53
Organism:
Homo sapiens (Human)
Description:
ChEMBL_1282402
Residue:
831
  
Inhibitor
Name:
BDBM50249498
Synonyms:
CHEMBL4095207
Type:
Small organic molecule
Emp. Form.:
C7H12N2O2
Mol. Mass.:
156.1824
SMILES:
CC(C)CCc1noc(=O)[nH]1
: