Target
Sortilin
Ligand
BDBM50249505
Substrate
Meas. Tech.
ChEBML_1680033
IC50
31623±n/a nM
Citation
 Andersen, JLLindberg, SLanggård, MMaltas, PJRønn, LCBBundgaard, CStrandbygaard, DThirup, SWatson, SP The identification of novel acid isostere based inhibitors of the VPS10P family sorting receptor Sortilin. Bioorg Med Chem Lett 27:2629-2633 (2017)  
Target
Name:
Sortilin
Synonyms:
Neurotensin receptor 3 SORT_HUMAN
Type:
PROTEIN
Mol. Mass.:
92054.53
Organism:
Homo sapiens (Human)
Description:
ChEMBL_1282402
Residue:
831
  
Inhibitor
Name:
BDBM50249505
Synonyms:
CHEMBL4071744
Type:
Small organic molecule
Emp. Form.:
C7H11NO2
Mol. Mass.:
141.1677
SMILES:
CC(C)CC1=NOC(=O)C1
: