Target
Sortilin
Ligand
BDBM50249506
Substrate
Meas. Tech.
ChEBML_1680033
IC50
158489±n/a nM
Citation
 Andersen, JLLindberg, SLanggård, MMaltas, PJRønn, LCBBundgaard, CStrandbygaard, DThirup, SWatson, SP The identification of novel acid isostere based inhibitors of the VPS10P family sorting receptor Sortilin. Bioorg Med Chem Lett 27:2629-2633 (2017)  
Target
Name:
Sortilin
Synonyms:
Neurotensin receptor 3 SORT_HUMAN
Type:
PROTEIN
Mol. Mass.:
92054.53
Organism:
Homo sapiens (Human)
Description:
ChEMBL_1282402
Residue:
831
  
Inhibitor
Name:
BDBM50249506
Synonyms:
CHEMBL1709220
Type:
Small organic molecule
Emp. Form.:
C9H7NO2
Mol. Mass.:
161.1574
SMILES:
O=C1CC(=NO1)c1ccccc1
: