Target
Mu-type opioid receptor
Ligand
BDBM50250450
Substrate
Meas. Tech.
ChEMBL_1681727 (CHEMBL4032004)
EC50
0.130000±n/a nM
Citation
 Dumitrascuta, MBen Haddou, TGuerrieri, ENoha, SMSchläfer, LSchmidhammer, HSpetea, M Synthesis, Pharmacology, and Molecular Docking Studies on 6-Desoxo-N-methylmorphinans as Potent?-Opioid Receptor Agonists. J Med Chem 60:9407-9412 (2017)  
Target
Name:
Mu-type opioid receptor
Synonyms:
M-OR-1 MOR-1 MUOR1 Mu opiate receptor OPRM1 hMOP | mu-type opioid receptor isoform MOR-1
Type:
G Protein-Coupled Receptor (GPCR)
Mol. Mass.:
44789.51
Organism:
Homo sapiens (Human)
Description:
P35372
Residue:
400
  
Inhibitor
Name:
BDBM50250450
Synonyms:
CHEMBL4103328
Type:
Small organic molecule
Emp. Form.:
C24H27NO3
Mol. Mass.:
377.4761
SMILES:
[H][C@@]12CCC[C@@]3(OCc4ccccc4)[C@@]4([H])Cc5ccc(O)c(O1)c5[C@@]23CCN4C
: