Target
Sodium-dependent dopamine transporter
Ligand
BDBM50250555
Substrate
Meas. Tech.
ChEBML_1681846
IC50
16600±n/a nM
Citation
 Kalaba, PAher, NYIli?, MDraga?evi?, VWieder, MMiklosi, AGZehl, MWackerlig, JRoller, ABeryozkina, TRadoman, BSaroja, SRLindner, WGonzalez, EPBakulev, VLeban, JJSitte, HHUrban, ELanger, TLubec, G Heterocyclic Analogues of Modafinil as Novel, Atypical Dopamine Transporter Inhibitors. J Med Chem 60:9330-9348 (2017)  
Target
Name:
Sodium-dependent dopamine transporter
Synonyms:
DA transporter DAT1 Dopamine transporter protein (DAT) SC6A3_HUMAN Sodium-dependent dopamine transporter Solute carrier family 6 member 3
Type:
Multi-pass membrane protein
Mol. Mass.:
68497.11
Organism:
Homo sapiens (Human)
Description:
Q01959
Residue:
620
  
Inhibitor
Name:
BDBM50250555
Synonyms:
CHEMBL4076722
Type:
Small organic molecule
Emp. Form.:
C18H15BrOS2
Mol. Mass.:
391.345
SMILES:
[O-][S+](Cc1csc(Br)c1)C(c1ccccc1)c1ccccc1
: