Target
Sodium-dependent noradrenaline transporter
Ligand
BDBM50250542
Substrate
Meas. Tech.
ChEBML_1681844
IC50
152500±n/a nM
Citation
 Kalaba, PAher, NYIli?, MDraga?evi?, VWieder, MMiklosi, AGZehl, MWackerlig, JRoller, ABeryozkina, TRadoman, BSaroja, SRLindner, WGonzalez, EPBakulev, VLeban, JJSitte, HHUrban, ELanger, TLubec, G Heterocyclic Analogues of Modafinil as Novel, Atypical Dopamine Transporter Inhibitors. J Med Chem 60:9330-9348 (2017)  
Target
Name:
Sodium-dependent noradrenaline transporter
Synonyms:
Monoamine transporter NET Noradrenaline Transporter (NET) Norepinephrine transporter protein (NET) SLC6A2 Sodium-dependent noradrenaline transporter (NET) | Solute carrier family 6 member 2
Type:
Multi-pass membrane protein
Mol. Mass.:
69337.72
Organism:
Homo sapiens (Human)
Description:
P23975
Residue:
617
  
Inhibitor
Name:
BDBM50250542
Synonyms:
CHEMBL4064788
Type:
Small organic molecule
Emp. Form.:
C19H18OS2
Mol. Mass.:
326.476
SMILES:
Cc1ccc(cc1)C([S+]([O-])Cc1cccs1)c1ccccc1
: