Target
Sodium-dependent serotonin transporter
Ligand
BDBM50250543
Substrate
Meas. Tech.
ChEBML_1681845
IC50
120500±n/a nM
Citation
 Kalaba, PAher, NYIli?, MDraga?evi?, VWieder, MMiklosi, AGZehl, MWackerlig, JRoller, ABeryozkina, TRadoman, BSaroja, SRLindner, WGonzalez, EPBakulev, VLeban, JJSitte, HHUrban, ELanger, TLubec, G Heterocyclic Analogues of Modafinil as Novel, Atypical Dopamine Transporter Inhibitors. J Med Chem 60:9330-9348 (2017)  
Target
Name:
Sodium-dependent serotonin transporter
Synonyms:
5-HT Transporter 5HTT SC6A4_HUMAN SLC6A4 Serotonin transporter (5HTT) Sodium-dependent serotonin transporter (SERT) | Solute carrier family 6 member 4
Type:
Multi-pass membrane protein
Mol. Mass.:
70322.51
Organism:
Homo sapiens (Human)
Description:
P31645
Residue:
630
  
Inhibitor
Name:
BDBM50250543
Synonyms:
CHEMBL4068156
Type:
Small organic molecule
Emp. Form.:
C18H14F2OS2
Mol. Mass.:
348.43
SMILES:
[O-][S+](Cc1cccs1)C(c1ccc(F)cc1)c1ccc(F)cc1
: