Target
Muscarinic acetylcholine receptor M2
Ligand
BDBM50005846
Substrate
Meas. Tech.
ChEMBL_139354 (CHEMBL752402)
Ki
30000±n/a nM
Citation
 Nordvall, GSundquist, SGlas, GGogoll, ANilvebrant, LHacksell, U Analogues of the muscarinic agent 2'-methylspiro[1-azabicyclo[2.2.2]octane-3,4'-[1,3]dioxolane]: synthesis and pharmacology. J Med Chem 35:1541-50 (1992)  
Target
Name:
Muscarinic acetylcholine receptor M2
Synonyms:
ACM2_HUMAN Cholinergic, muscarinic M2 Muscarinic acetylcholine receptor M2 and M5 | RecName: Full=Muscarinic acetylcholine receptor M2
Type:
GPCR
Mol. Mass.:
51730.61
Organism:
Homo sapiens (Human)
Description:
P08172
Residue:
466
  
Inhibitor
Name:
BDBM50005846
Synonyms:
2',2'-dimethylspiro[4-azabicyclo[2.2.2]octane-2,4'-[1,3]dioxolane] | CHEMBL39922
Type:
Small organic molecule
Emp. Form.:
C11H19NO2
Mol. Mass.:
197.2741
SMILES:
CC1(C)OCC2(CN3CCC2CC3)O1
: