Target
CREB-binding protein
Ligand
BDBM50250885
Substrate
Meas. Tech.
ChEBML_1682592
IC50
99000±n/a nM
Citation
 Bronner, SMMurray, JRomero, FALai, KWTsui, VCyr, PBeresini, MHde Leon Boenig, GChen, ZChoo, EFClark, KRCrawford, TDJayaram, HKaufman, SLi, RLi, YLiao, JLiang, XLiu, WLy, JMaher, JWai, JWang, FZheng, AZhu, XMagnuson, S A Unique Approach to Design Potent and Selective Cyclic Adenosine Monophosphate Response Element Binding Protein, Binding Protein (CBP) Inhibitors. J Med Chem 60:10151-10171 (2017)  
Target
Name:
CREB-binding protein
Synonyms:
CBP CREB-binding protein (CBP) CREBBP
Type:
Transcription Coactivator
Mol. Mass.:
265411.66
Organism:
Homo sapiens (Human)
Description:
Q92793
Residue:
2442
  
Inhibitor
Name:
BDBM50250885
Synonyms:
CHEBI:65019 | CHEMBL2270066
Type:
Small organic molecule
Emp. Form.:
C10H9NO2
Mol. Mass.:
175.184
SMILES:
COC(=O)c1c[nH]c2ccccc12
: