Target
Muscarinic acetylcholine receptor M1
Ligand
BDBM50453190
Substrate
Meas. Tech.
ChEBML_138935
Ki
7010±n/a nM
Citation
 Carroll, FIAbraham, PChemburkar, SHe, XCMascarella, SWKwon, YWTriggle, DJ Synthesis and muscarinic receptor activity of ester derivatives of 2-substituted 2-azabicyclo[2.2.1]heptan-5-ol and -6-ol. J Med Chem 35:2184-91 (1992)  
Target
Name:
Muscarinic acetylcholine receptor M1
Synonyms:
ACM1_RAT Chrm-1 cholinergic receptor, muscarinic 1
Type:
Enzyme Catalytic Domain
Mol. Mass.:
51390.46
Organism:
RAT
Description:
P08482
Residue:
460
  
Inhibitor
Name:
BDBM50453190
Synonyms:
CHEMBL2114059
Type:
Small organic molecule
Emp. Form.:
C15H19NO2
Mol. Mass.:
245.3169
SMILES:
CC(=O)O[C@H]1CC2CC1N(Cc1ccccc1)C2
: