Target
Acetylcholinesterase
Ligand
BDBM50171021
Substrate
Meas. Tech.
ChEBML_1684524
IC50
>200000±n/a nM
Citation
 Knutsson, SKindahl, TEngdahl, CNikjoo, DForsgren, NKitur, SEkström, FKamau, LLinusson, A N-Aryl-N'-ethyleneaminothioureas effectively inhibit acetylcholinesterase 1 from disease-transmitting mosquitoes. Eur J Med Chem 134:415-427 (2017)  
Target
Name:
Acetylcholinesterase
Synonyms:
ACES_HUMAN Acetylcholinesterase (AChE) | Acetylcholinesterase (human AChE)
Type:
Enzyme
Mol. Mass.:
67792.70
Organism:
Homo sapiens (Human)
Description:
P22303
Residue:
614
  
Inhibitor
Name:
BDBM50171021
Synonyms:
4-[3-(2-Dimethylamino-ethyl)-thioureido]-benzenesulfonamide | CHEMBL179218
Type:
Small organic molecule
Emp. Form.:
C11H18N4O2S2
Mol. Mass.:
302.416
SMILES:
CN(C)CCNC(=S)Nc1ccc(cc1)S(N)(=O)=O
: