Target
D(2) dopamine receptor
Ligand
BDBM50007143
Substrate
Meas. Tech.
ChEMBL_62257 (CHEMBL675484)
Ki
2710±n/a nM
Citation
 DeNinno, MPSchoenleber, RPerner, RJLijewski, LAsin, KEBritton, DRMacKenzie, RKebabian, JW Synthesis and dopaminergic activity of 3-substituted 1-(aminomethyl)-3,4-dihydro-5,6-dihydroxy-1H-2-benzopyrans: characterization of an auxiliary binding region in the D1 receptor. J Med Chem 34:2561-9 (1991)  
Target
Name:
D(2) dopamine receptor
Synonyms:
DOPAMINE D2 DOPAMINE D2 Short Dopamine D2 receptor Drd2
Type:
G Protein-Coupled Receptor (GPCR)
Mol. Mass.:
50931.60
Organism:
Rattus norvegicus (rat)
Description:
P61169
Residue:
444
  
Inhibitor
Name:
BDBM50007143
Synonyms:
1-Aminomethyl-3-(4-methoxy-benzyl)-isochroman-5,6-diol | CHEMBL87897
Type:
Small organic molecule
Emp. Form.:
C18H21NO4
Mol. Mass.:
315.3636
SMILES:
COc1ccc(CC2Cc3c(O)c(O)ccc3[C@H](CN)O2)cc1
: