Target
Mu-type opioid receptor
Ligand
BDBM50254124
Substrate
Meas. Tech.
ChEMBL_1686074 (CHEMBL4036553)
Ki
0.455000±n/a nM
Citation
 Watanabe, YHayashida, KSaito, DTakahashi, TSakai, JNakata, EKanda, TIwai, THirayama, SFujii, HYamakawa, TNagase, H Design and synthesis of novel? opioid receptor agonists with an azatricyclodecane skeleton for improving blood-brain barrier penetration. Bioorg Med Chem Lett 27:3495-3498 (2017)  
Target
Name:
Mu-type opioid receptor
Synonyms:
M-OR-1 MOR-1 MUOR1 Mu opiate receptor OPRM1 hMOP | mu-type opioid receptor isoform MOR-1
Type:
G Protein-Coupled Receptor (GPCR)
Mol. Mass.:
44789.51
Organism:
Homo sapiens (Human)
Description:
P35372
Residue:
400
  
Inhibitor
Name:
BDBM50254124
Synonyms:
CHEMBL4103044
Type:
Small organic molecule
Emp. Form.:
C28H32N2O3
Mol. Mass.:
444.5653
SMILES:
[H][C@]12CN(C3CCC4(C1)C1Cc5ccc(O)cc5C4(CCN1CC1CC1)C23)C(=O)c1ccoc1
: