Target
Bifunctional 3'-phosphoadenosine 5'-phosphosulfate synthase 2
Ligand
BDBM50254387
Substrate
Meas. Tech.
ChEBML_1686350
EC50
>10000±n/a nM
Citation
 Pryde, DCMarron, BEWest, CWReister, SAmato, GYoger, KAntonio, BPadilla, KCox, PJTurner, JWarmus, JSSwain, NAOmoto, KMahoney, JHGerlach, AC Discovery of a Series of Indazole TRPA1 Antagonists. ACS Med Chem Lett 8:666-671 (2017)  
Target
Name:
Bifunctional 3'-phosphoadenosine 5'-phosphosulfate synthase 2
Synonyms:
2.7.1.25 APS kinase ATPSK2 PAPS synthase 2 PAPSS 2 SAT SK2 Sulfate adenylyltransferase | Sulfurylase kinase 2
Type:
PROTEIN
Mol. Mass.:
69514.02
Organism:
Homo sapiens
Description:
ChEMBL_117395
Residue:
614
  
Inhibitor
Name:
BDBM50254387
Synonyms:
CHEMBL4062193
Type:
Small organic molecule
Emp. Form.:
C13H7F5N4O
Mol. Mass.:
330.2129
SMILES:
Fc1ccc(Nc2n[nH]c3cc(OC(F)(F)F)cnc23)cc1F
: