Target
Metabotropic glutamate receptor 7
Ligand
BDBM50007548
Substrate
Meas. Tech.
ChEBML_1687018
EC50
249000±n/a nM
Citation
 Selvam, CLemasson, IABrabet, IOueslati, NKaraman, BCabaye, ATora, ASCommare, BCourtiol, TCesarini, SMcCort-Tranchepain, IRigault, DMony, LBessiron, TMcLean, HLeroux, FRColobert, FDaniel, HGoupil-Lamy, ABertrand, HOGoudet, CPin, JPAcher, FC Increased Potency and Selectivity for Group III Metabotropic Glutamate Receptor Agonists Binding at Dual sites. J Med Chem 61:1969-1989 (2018)  
Target
Name:
Metabotropic glutamate receptor 7
Synonyms:
GPRC1G GRM7 protein MGLUR7 metabotropic glutamate 7
Type:
Enzyme Catalytic Domain
Mol. Mass.:
102262.98
Organism:
Homo sapiens (Human)
Description:
Q14831
Residue:
915
  
Inhibitor
Name:
BDBM50007548
Synonyms:
(S)-2-Amino-4-phosphono-butyric acid 2-Amino-3-(3,5-dioxo-[1,2,4]oxadiazolidin-2-yl)-propionic acid 2-Amino-4-phosphono-butyric acid(S-AP4) 2-amino-4-phosphonobutyric acid L-(+)-2-amino-4-phosphonobutyric acid L-AP4 | L-APB
Type:
Small organic molecule
Emp. Form.:
C4H10NO5P
Mol. Mass.:
183.0997
SMILES:
N[C@@H](CCP(O)(O)=O)C(O)=O
: