Target
NAD-dependent protein deacylase sirtuin-5, mitochondrial
Ligand
BDBM50255710
Substrate
Meas. Tech.
ChEBML_1687482
IC50
15±n/a nM
Citation
 Kalbas, DLiebscher, SNowak, TMeleshin, MPannek, MPopp, CAlhalabi, ZBordusa, FSippl, WSteegborn, CSchutkowski, M Potent and Selective Inhibitors of Human Sirtuin 5. J Med Chem 61:2460-2471 (2018)  
Target
Name:
NAD-dependent protein deacylase sirtuin-5, mitochondrial
Synonyms:
NAD-dependent protein deacetylase sirtuin-5 (SIRT5) Regulatory protein SIR2 homolog 5 SIR2L5 SIRT5
Type:
Protein
Mol. Mass.:
33892.62
Organism:
Homo sapiens (Human)
Description:
Q9NXA8
Residue:
310
  
Inhibitor
Name:
BDBM50255710
Synonyms:
CHEMBL4091258
Type:
Small organic molecule
Emp. Form.:
C62H82N10O15S
Mol. Mass.:
1239.437
SMILES:
CC(C)C[C@H](NC(=O)[C@@H](NC(=O)CNC(=O)c1ccccc1)C(C)C)C(=O)N[C@@H](CCCCNC(=O)C[C@H](SCc1cccc2ccccc12)C(O)=O)C(=O)N[C@@H](CCC(O)=O)C(=O)N[C@@H](Cc1ccc(O)cc1)C(=O)NCC(=O)N[C@@H](C(C)C)C(N)=O
: